{"text_format":"1","workbook":"xlsx","n_sheets":6,"sheets":["Identification","Instructions","Mouvement","Registre","Impacts","Validations"],"not_rendered":{"charts":0,"images":2,"macros":1,"external_links":0,"defined_names":48,"comments":0,"pivot_tables":0},"unopened":[],"bounds":{"document_bytes":16777216,"sheet_cells":100000,"rows_first":2000,"rows_last":500,"rows_between":2000,"halvings":0,"cell_chars":16384,"cell_head_chars":4096},"cells_cut":0,"cells_raw":0,"read":"whole","date_system":"1900"}

{"sheet":"Identification","index":0,"n_rows":35,"n_cols":2,"rows_kept":35,"cut":false,"hidden":false,"merged":[[23,3,23,6],[30,0,30,8],[32,0,32,8],[34,0,34,8]]}
[]
[]
[]
[]
[]
[]
[]
[]
[]
[]
[]
[]
[]
[]
[]
[]
[]
[]
[]
[]
[]
[]
[]
[null,"Établissement * : "]
[]
[]
[]
[]
[]
[]
["SVP nous retourner le formulaire avant le : 25 juin 2021"]
[]
["Transmettre par courriel à : moi-agence@ssss.gouv.qc.ca "]
[]
["Pour toutes questions, veuillez également écrire à : moi-agence@ssss.gouv.qc.ca "]

{"sheet":"Instructions","index":1,"n_rows":30,"n_cols":3,"rows_kept":30,"cut":false,"hidden":false,"merged":[[29,1,29,3],[18,1,18,3],[22,1,22,3],[8,1,8,3],[13,1,13,3],[15,1,15,3],[20,1,20,3],[24,1,24,3]]}
[]
[]
[]
[]
[]
[]
[null,"Instructions pour l'onglet « Mouvement »"]
[]
[null,"1. Répondre, à l'aide des menus déroulants, aux questions portant sur le recrutement et l’embauche de personnes salariées par des agences ainsi que sur les motifs suscitant les départs."]
[]
[]
[null,"Instructions pour l'onglet « Registre »"]
[]
[null,{"$f":"\"1. Répertorier dans l'onglet Registre toutes les personnes salariées qui ont quitté votre établissement entre le\" & TEXT(Validations!I7,\" j mmm aaaa\") & \" et le\" & TEXT(Validations!I8,\" j mmm aaaa\") &\" et qui sont membres d’un ordre professionnel apparaissant dans le menu déroulant.\"","v":"1. Répertorier dans l'onglet Registre toutes les personnes salariées qui ont quitté votre établissement entre le 13 mars 2020 et le 31 mai 2021 et qui sont membres d’un ordre professionnel apparaissant dans le menu déroulant."}]
[]
[null,"2. Ne pas répertorier les personnes salariées ayant quitté durant cette période et qui :\n      • sont membres d’autres ordres professionnels; \n      • ne sont membres d’aucun ordre professionnel;\n      • ont été embauchées par le biais de contrats temporaires dans le contexte de l’urgence sanitaire  "]
[null,null," (par exemple : les embauches « Je Contribue »)."]
[]
[null,"3. Pour chaque personne identifiée dans le registre, veuillez vérifier au tableau de l’ordre professionnel l’employeur indiqué au dossier de cette personne. Ces tableaux sont disponibles sur les sites Web des différents ordres professionnels."]
[]
[null,"4. Veuillez noter que pour les colonnes « Ordre professionnel » et « Titre d’emploi » (colonnes D et F) où, respectivement, l’ordre professionnel de la personne ainsi que son titre d’emploi doivent être identifiés, vous devez d’abord sélectionner l’ordre professionnel dans le menu déroulant correspondant, autrement, aucun menu déroulant pour le titre d’emploi ne s’affichera. "]
[]
[null,"5. Veuillez remplir la colonne « Nom du nouvel employeur selon l’ordre » (colonne H) de l’onglet registre en reproduisant le nom de l’employeur qui apparait dans au tableau de l’ordre professionnel. Même si cette personne a pris sa retraite, veuillez vérifier l’information auprès du tableau de l’ordre et indiquer le nom de l’employeur qui y apparait, le cas échéant. Si aucun nom d’employeur ne s’affiche au tableau de l’ordre, veuillez indiquer « aucun ».  "]
[]
[null,"6. Veuillez remplir la colonne « Type du nouvel employeur » (colonne I) de l’onglet registre en choisissant l’un des choix du menu déroulant. Cette information est en lien avec ce que vous aurez indiqué à la colonne précédente « Nom du nouvel employeur selon l’ordre » (colonne H)."]
[]
[]
[null,"Instructions pour l'onglet « Impacts »"]
[]
[null,"1. Voir les instructions au début de l'onglet Impacts."]

{"sheet":"Mouvement","index":2,"n_rows":59,"n_cols":2,"rows_kept":59,"cut":false,"hidden":false,"merged":[[60,1,62,3],[36,1,36,3],[51,1,51,3],[47,1,49,3],[28,1,28,2],[5,1,5,3],[17,1,17,2],[32,1,34,3],[53,1,53,2],[8,4,8,5],[9,4,9,5],[11,4,11,5],[12,4,12,5],[26,1,26,3],[15,1,15,3],[21,1,23,3]]}
[]
[]
[]
[]
[]
[null,"Questionnaire portant sur les mouvements de personnel liés à la main-d'œuvre indépendante"]
[]
[]
[null,"Nom de la personne qui complète le formulaire : "]
[null,"Courriel : "]
[]
[null,"Approuvé par : "]
[null,"Courriel : "]
[]
[]
[null,{"$f":"\"1. Pour la période entre le\" & TEXT(Validations!I7,\" j mmm aaaa\") & \" et le\" & TEXT(Validations!I8,\" j mmm aaaa\") &\", avez-vous des exemples de situations où des prestataires de services d’agences ont sollicité le personnel de votre établissement?\"","v":"1. Pour la période entre le 13 mars 2020 et le 31 mai 2021, avez-vous des exemples de situations où des prestataires de services d’agences ont sollicité le personnel de votre établissement?"}]
[]
[]
[]
[null,"Si oui, veuillez préciser (titre d’emploi visé, descriptif des événements, etc.)"]
[]
[]
[]
[]
[]
[]
[null,{"$f":"\"2. Pour la période entre le\" & TEXT(Validations!I7,\" j mmm aaaa\") & \" et le\" & TEXT(Validations!I8,\" j mmm aaaa\") &\", avez-vous des exemples de situations où une ou des agences ont embauché le personnel de votre établissement?\"","v":"2. Pour la période entre le 13 mars 2020 et le 31 mai 2021, avez-vous des exemples de situations où une ou des agences ont embauché le personnel de votre établissement?"}]
[]
[]
[]
[null,"Si oui, veuillez préciser (titre d’emploi visé, descriptif des événements, etc.)"]
[]
[]
[]
[]
[]
[null,"3. À votre connaissance, quels sont les motifs qui poussent le personnel à quitter votre établissement pour aller travailler en agence?  "]
[]
[null,"Salaire plus élevé"]
[null,"Paiement de la cotisation professionnelle"]
[null,"Avantages sociaux plus généreux"]
[null,"Horaires de travail"]
[null,"Moins de temps supplémentaires obligatoires"]
[null,"Autre"]
[]
[null,"Si vous avez sélectionné « Autre », veuillez préciser."]
[]
[]
[]
[]
[]
[null,"4. À votre connaissance, votre établissement a-t-il déjà produit un état de situation ou tout autre type de document résumant les impacts négatifs de la main-d’œuvre indépendante (MOI)? "]
[]
[]
[]
[null,"Si oui, merci de transmettre par courriel ce(s) document(s) en même temps que ce questionnaire."]
[]
[]
[null,"5. Avez-vous des commentaires à ajouter? "]

{"sheet":"Registre","index":3,"n_rows":1016,"n_cols":9,"rows_kept":1016,"cut":false,"hidden":false,"merged":[[12,4,12,5],[9,3,9,5],[8,3,8,5],[6,1,6,3],[5,1,5,3],[11,4,11,5]]}
[]
[]
[]
[]
[]
[null,"Répertoire des personnes salariées ayant quitté "]
[null,{"$f":"\" l'établissement entre le\" & TEXT(Validations!I7,\" j mmm aaaa\") & \" et le\" & TEXT(Validations!I8,\" j mmm aaaa\")","v":" l'établissement entre le 13 mars 2020 et le 31 mai 2021"}]
[]
[null,"Nom de la personne qui complète le formulaire : "]
[null,"Courriel : "]
[]
[null,"Approuvé par : "]
[null,"Courriel : "]
[]
[]
[null,"Prénom","Nom","Ordre professionnel",null,"Titre d'emploi","Date de fin\nd'emploi","Nom du nouvel employeur selon l'ordre","Type du nouvel employeur"]
[null,null,null,null,{"$f":"\"Ordre_\" & VLOOKUP(D17,Ordre_Valeur,2,0)","v":{"$error":"#N/A"}}]
[null,null,null,null,{"$error":"#N/A"}]
[null,null,null,null,{"$error":"#N/A"}]
[null,null,null,null,{"$error":"#N/A"}]
[null,null,null,null,{"$error":"#N/A"}]
[null,null,null,null,{"$error":"#N/A"}]
[null,null,null,null,{"$error":"#N/A"}]
[null,null,null,null,{"$error":"#N/A"}]
[null,null,null,null,{"$error":"#N/A"}]
[null,null,null,null,{"$error":"#N/A"}]
[null,null,null,null,{"$error":"#N/A"}]
[null,null,null,null,{"$error":"#N/A"}]
[null,null,null,null,{"$error":"#N/A"}]
[null,null,null,null,{"$error":"#N/A"}]
[null,null,null,null,{"$error":"#N/A"}]
[null,null,null,null,{"$error":"#N/A"}]
[null,null,null,null,{"$error":"#N/A"}]
[null,null,null,null,{"$error":"#N/A"}]
[null,null,null,null,{"$error":"#N/A"}]
[null,null,null,null,{"$error":"#N/A"}]
[null,null,null,null,{"$error":"#N/A"}]
[null,null,null,null,{"$error":"#N/A"}]
[null,null,null,null,{"$error":"#N/A"}]
[null,null,null,null,{"$error":"#N/A"}]
[null,null,null,null,{"$error":"#N/A"}]
[null,null,null,null,{"$error":"#N/A"}]
[null,null,null,null,{"$error":"#N/A"}]
[null,null,null,null,{"$error":"#N/A"}]
[null,null,null,null,{"$error":"#N/A"}]
[null,null,null,null,{"$error":"#N/A"}]
[null,null,null,null,{"$error":"#N/A"}]
[null,null,null,null,{"$error":"#N/A"}]
[null,null,null,null,{"$error":"#N/A"}]
[null,null,null,null,{"$error":"#N/A"}]
[null,null,null,null,{"$error":"#N/A"}]
[null,null,null,null,{"$error":"#N/A"}]
[null,null,null,null,{"$error":"#N/A"}]
[null,null,null,null,{"$error":"#N/A"}]
[null,null,null,null,{"$error":"#N/A"}]
[null,null,null,null,{"$error":"#N/A"}]
[null,null,null,null,{"$error":"#N/A"}]
[null,null,null,null,{"$error":"#N/A"}]
[null,null,null,null,{"$error":"#N/A"}]
[null,null,null,null,{"$error":"#N/A"}]
[null,null,null,null,{"$error":"#N/A"}]
[null,null,null,null,{"$error":"#N/A"}]
[null,null,null,null,{"$error":"#N/A"}]
[null,null,null,null,{"$error":"#N/A"}]
[null,null,null,null,{"$error":"#N/A"}]
[null,null,null,null,{"$error":"#N/A"}]
[null,null,null,null,{"$error":"#N/A"}]
[null,null,null,null,{"$error":"#N/A"}]
[null,null,null,null,{"$error":"#N/A"}]
[null,null,null,null,{"$error":"#N/A"}]
[null,null,null,null,{"$error":"#N/A"}]
[null,null,null,null,{"$error":"#N/A"}]
[null,null,null,null,{"$error":"#N/A"}]
[null,null,null,null,{"$error":"#N/A"}]
[null,null,null,null,{"$error":"#N/A"}]
[null,null,null,null,{"$error":"#N/A"}]
[null,null,null,null,{"$error":"#N/A"}]
[null,null,null,null,{"$error":"#N/A"}]
[null,null,null,null,{"$error":"#N/A"}]
[null,null,null,null,{"$error":"#N/A"}]
[null,null,null,null,{"$f":"\"Ordre_\" & VLOOKUP(D81,Ordre_Valeur,2,0)","v":{"$error":"#N/A"}}]
[null,null,null,null,{"$error":"#N/A"}]
[null,null,null,null,{"$error":"#N/A"}]
[null,null,null,null,{"$error":"#N/A"}]
[null,null,null,null,{"$error":"#N/A"}]
[null,null,null,null,{"$error":"#N/A"}]
[null,null,null,null,{"$error":"#N/A"}]
[null,null,null,null,{"$error":"#N/A"}]
[null,null,null,null,{"$error":"#N/A"}]
[null,null,null,null,{"$error":"#N/A"}]
[null,null,null,null,{"$error":"#N/A"}]
[null,null,null,null,{"$error":"#N/A"}]
[null,null,null,null,{"$error":"#N/A"}]
[null,null,null,null,{"$error":"#N/A"}]
[null,null,null,null,{"$error":"#N/A"}]
[null,null,null,null,{"$error":"#N/A"}]
[null,null,null,null,{"$error":"#N/A"}]
[null,null,null,null,{"$error":"#N/A"}]
[null,null,null,null,{"$error":"#N/A"}]
[null,null,null,null,{"$error":"#N/A"}]
[null,null,null,null,{"$error":"#N/A"}]
[null,null,null,null,{"$error":"#N/A"}]
[null,null,null,null,{"$error":"#N/A"}]
[null,null,null,null,{"$error":"#N/A"}]
[null,null,null,null,{"$error":"#N/A"}]
[null,null,null,null,{"$error":"#N/A"}]
[null,null,null,null,{"$error":"#N/A"}]
[null,null,null,null,{"$error":"#N/A"}]
[null,null,null,null,{"$error":"#N/A"}]
[null,null,null,null,{"$error":"#N/A"}]
[null,null,null,null,{"$error":"#N/A"}]
[null,null,null,null,{"$error":"#N/A"}]
[null,null,null,null,{"$error":"#N/A"}]
[null,null,null,null,{"$error":"#N/A"}]
[null,null,null,null,{"$error":"#N/A"}]
[null,null,null,null,{"$error":"#N/A"}]
[null,null,null,null,{"$error":"#N/A"}]
[null,null,null,null,{"$error":"#N/A"}]
[null,null,null,null,{"$error":"#N/A"}]
[null,null,null,null,{"$error":"#N/A"}]
{"$rows_left_out":897}
{"sheet":"Impacts","index":4,"n_rows":162,"n_cols":3,"rows_kept":162,"cut":false,"hidden":false,"merged":[[89,1,91,2],[101,1,103,2],[40,4,40,5],[41,4,41,5],[163,1,165,2],[151,1,153,2],[5,1,5,2],[8,1,8,2],[12,1,12,2],[30,1,30,2],[16,1,16,2],[22,1,22,2],[26,1,26,2],[34,1,34,2],[57,1,59,2],[73,1,75,2],[115,1,117,2],[133,1,135,2]]}
[]
[]
[]
[]
[]
[null,"Questionnaire sur l'évaluation des impacts du retrait au recours à la main-d’œuvre indépendante"]
[]
[]
[null,"Dans le cadre des travaux effectués dans le chantier visant le retrait du recours à l’utilisation de la main-d’œuvre indépendante et d’apporter son soutien aux établissements du RSSS, le MSSS désire obtenir un portrait lui permettant d’identifier les enjeux et les risques selon les secteurs d’activités de l’ensemble des établissements du réseau.\n\nÀ cet effet, nous demandons à chacun des établissements du RSSS de remplir les tableaux ci-joints afin d’identifier les risques de rupture de soins et services liés au retrait du recours à l’utilisation de la main-d’œuvre indépendante."]
[]
[null,"Consigne pour remplir les tableaux"]
[]
[null,"Le recours à l’utilisation de la MOI aura un effet temporaire sur le maintien de l’offre de soins et services. L’évaluation du risque de rupture (bris) de soins et services doit être basée sur les risques réels et sur l’impact de ce retrait pour la clientèle. L’évaluation doit tenir compte du recours aux plans de contingence et autres mesures prévues avant d’en arriver à l’utilisation de la main-d’œuvre indépendante.\n\nÀ partir de la légende présentée ci-dessous, veuillez remplir les tableaux en utilisant les menus déroulants. Si un service ne se retrouve pas dans les services proposés selon les titres d’emploi, vous pouvez cocher la case autre et inscrire la situation dans la section commentaires. Si la situation est non-applicable dans votre établissement, vous pouvez inscrire N/A dans la case. Vous pouvez également insérer des commentaires liés à des situations spécifiques de votre établissement pour chacun des titres d’emploi proposés afin de nous permettre d’identifier plus facilement les services et les secteurs ou le recours à la MOI est plus problématique."]
[]
[null,"Légende à utiliser pour remplir les tableaux"]
[]
[null,"Définition de rupture (bris) de service : par rupture (bris) de soins et services, nous entendons une interruption dans la continuité des soins et services offerts à la population malgré la mise en place de mesures compensatoires (ex : réorganisation, TSO, etc.)."]
[]
[null,"Risque de rupture de soins et services "]
[]
[null,"4 - Risque extrême"]
[]
[null,"Le retrait de l’utilisation de la MOI occasionnera automatiquement une rupture (bris) de service immédiate sur les soins et services à offrir à la population et sur une période souvent indéterminée. L’établissement n’a aucune autre alternative pour assurer les soins et services à sa population.   "]
[]
[null,"3 - Risque important"]
[]
[null,"Le retrait de l’utilisation de la MOI pourrait possiblement occasionner une rupture (bris) de service pour une certaine période à très court terme (dans les jours suivants). L’établissement possède peu d’alternatives pour assurer les soins et services à sa population.  "]
[]
[null,"2 - Risque modéré "]
[]
[null,"Le retrait de l’utilisation de la MOI pourrait possiblement occasionner des problématiques menant éventuellement à une rupture (bris) de service temporaire. L’établissement peut utiliser quelques alternatives autres pour assurer les soins et services à sa population."]
[]
[null,"1 - Risque faible  "]
[]
[null,"Le retrait de l’utilisation de la MOI occasionnera des désagréments, mais il y aura peu de chance de mener à une éventuelle rupture (bris) de service. L’établissement peut utiliser des alternatives autres pour assurer les soins et services à sa population."]
[]
[]
[null,"Nom de la personne qui complète le formulaire : "]
[null,"Courriel : "]
[]
[null,"Approuvé par : "]
[null,"Courriel : "]
[]
[]
[null,"Soins infirmiers (infirmières cliniciennes et infirmières)"]
[]
[null,"Secteurs","Risques"]
[null,"Urgence"]
[null,"Obstétrique"]
[null,"CHSLD"]
[null,"SAD"]
[null,"Soins intensifs"]
[null,"Bloc opératoire / chirurgie"]
[null,"Autre"]
[]
[null,"Commentaires"]
[]
[]
[]
[]
[]
[null,"Soins infirmiers (Infirmières auxiliaires)"]
[]
[null,"Secteurs","Risques"]
[null,"Urgence"]
[null,"Périnatalité"]
[null,"CHSLD"]
[null,"SAD"]
[null,"Bloc opératoire / chirurgie"]
[null,"Autre"]
[]
[null,"Commentaires"]
[]
[]
[]
[]
[]
[null,"Soins d’assistance (préposés aux bénéficiaires)"]
[]
[null,"Secteurs","Risques"]
[null,"Urgence"]
[null,"Obstétrique"]
[null,"CHSLD"]
[null,"SAD"]
[null,"Bloc opératoire / chirurgie"]
[null,"Autre"]
[]
[null,"Commentaires"]
[]
[]
[]
[]
[]
[null,"Soins d’assistance (auxiliaires aux services de santé et sociaux)"]
[]
[null,"Secteurs","Risques"]
[null,"SAD"]
[null,"Autre"]
[]
[null,"Commentaires"]
[]
[]
[]
[]
[]
[null,"Inhalothérapeutes"]
[]
[null,"Secteurs","Risques"]
[null,"Inhalothérapie"]
[null,"Bloc opératoire / chirurgie"]
[null,"Soins critiques"]
[null,"Autre"]
[]
[null,"Commentaires"]
[]
[]
[]
[]
[]
[null,"Psychosocial (travailleurs sociaux)"]
{"$rows_left_out":43}
{"sheet":"Validations","index":5,"n_rows":162,"n_cols":9,"rows_kept":162,"cut":false,"hidden":true,"merged":[]}
["Type employeur",null,{"$f":"COUNTIF(C3,\"Erreur\")","v":1},null,{"$f":"COUNTIF(E3:E10,\"Erreur\")","v":6},{"$f":"SUM(C1:E1)","v":7},"Établissements"]
["Agence (MOI)",null,null,null,null,null,"1104-2280 – Centre Le Cardinal Inc."]
["Retraite",null,{"$f":"IF(ISBLANK(Identification!D24),\"Erreur\",\"OK\")","v":"Erreur"},null,{"$f":"IF(ISBLANK(Mouvement!D9),\"Erreur\",\"OK\")","v":"Erreur"},null,"1104-2686 – CRSSS de la Baie-James"]
["Autre",null,null,null,{"$f":"IF(ISBLANK(Mouvement!D10),\"Erreur\",\"OK\")","v":"Erreur"},null,"1104-2918 – CHUM"]
[null,null,null,null,null,null,"1104-3791 – CHSLD de la Côte Boisée Inc."]
[null,null,null,null,{"$f":"IF(ISBLANK(Registre!C9),\"Erreur\",\"OK\")","v":"Erreur"},null,"1104-3866 – CLSC Naskapi"]
[null,null,null,null,{"$f":"IF(ISBLANK(Registre!C10),\"Erreur\",\"OK\")","v":"Erreur"},null,"1104-4088 – CISSS des Îles","Date min:","2020-03-13"]
[null,null,null,null,null,null,"1104-4823 – CHSLD Providence–Saint-Joseph Inc.","Date max :","2021-05-31"]
[null,null,null,null,{"$f":"IF(ISBLANK(Impacts!C38),\"Erreur\",\"OK\")","v":"Erreur"},null,"1104-5051 – CHU de Québec"]
[null,null,null,null,{"$f":"IF(ISBLANK(Impacts!C39),\"Erreur\",\"OK\")","v":"Erreur"},null,"1104-5119 – CISSS du Bas-Saint-Laurent"]
["Catégorie",null,null,null,null,null,"1104-5127 – CIUSSS du Saguenay–Lac-Saint-Jean"]
["Catégorie 1",null,null,null,null,null,"1104-5135 – CIUSSS de la Capitale-Nationale"]
["Catégorie 2",null,null,null,null,null,"1104-5143 – CIUSSS de la Mauricie-et-du-Centre-du-Québec"]
["Catégorie 3",null,null,null,null,null,"1104-5150 – CIUSSS de l'Estrie - CHUS"]
["Catégorie 4",null,null,null,null,null,"1104-5168 – CIUSSS de l'Ouest-de-l'Île-de-Montréal"]
[null,null,null,null,null,null,"1104-5176 – CIUSSS du Centre-Ouest-de-l'Île-de-Montréal"]
["Risque rupture",null,null,null,null,null,"1104-5184 – CIUSSS du Centre-Sud-de-l'Île-de-Montréal"]
["4 - Risque extrême",null,null,null,null,null,"1104-5192 – CIUSSS du Nord-de-l'Île-de-Montréal"]
["3 - Risque important",null,null,null,null,null,"1104-5200 – CIUSSS de l'Est-de-l'Île-de-Montréal"]
["2 - Risque modéré ",null,null,null,null,null,"1104-5218 – CISSS de l'Outaouais"]
["1 - Risque faible",null,null,null,null,null,"1104-5226 – CISSS de l'Abitibi-Témiscamingue"]
["0 - N/A",null,null,null,null,null,"1104-5234 – CISSS de la Côte-Nord"]
[null,null,null,null,null,null,"1104-5242 – CISSS de la Gaspésie"]
["Oui",null,null,null,null,null,"1104-5267 – CISSS de Laval"]
["Non",null,null,null,null,null,"1104-5275 – CISSS de Lanaudière"]
[null,null,null,null,null,null,"1104-5283 – CISSS des Laurentides"]
[null,null,null,null,null,null,"1104-5291 – CISSS de la Montérégie-Centre"]
["0 à 99",null,null,null,null,null,"1104-5309 – CISSS de la Montérégie-Est"]
["100 à 199",null,null,null,null,null,"1104-5317 – CISSS de la Montérégie-Ouest"]
["200 à 299",null,null,null,null,null,"1104-5333 – CISSS de Chaudière-Appalaches"]
["300 à 399",null,null,null,null,null,"1175-5501 – CHSLD Providence N-D-de-Lourdes Inc."]
["400 à 499",null,null,null,null,null,"1211-4922 – Atelier le fil d'Ariane Inc."]
["500 et plus",null,null,null,null,null,"1232-6849 – Résidence Angelica"]
[null,null,null,null,null,null,"1236-6043 – CHSLD Bayview Inc."]
["Ordre",null,null,null,null,null,"1238-3907 – Résidence Berthiaume-Du Tremblay"]
["01 – Ordre des conseillers et conseillères d'orientation du Québec",1,null,null,null,null,"1243-1656 – Institut de cardiologie de Montréal"]
["02 – Ordre des ergothérapeutes du Québec",2,null,null,null,null,"1245-2645 – Hôpital Marie-Clarac"]
["03 – Ordre des hygiénistes dentaires du Québec",3,null,null,null,null,"1245-3676 – Clinique communautaire de Pointe-St-Charles"]
["04 – Ordre des infirmières et infirmiers auxiliaires du Québec",4,null,null,null,null,"1256-2179 – Maison Elizabeth"]
["05 – Ordre des infirmières et infirmiers du Québec",5,null,null,null,null,"1259-9213 – CUSM"]
["06 – Ordre des inhalothérapeutes du Québec",6,null,null,null,null,"1265-2384 – Havre-Jeunesse"]
["07 – Ordre des opticiens d'ordonnances du Québec",7,null,null,null,null,"1265-3192 – CHSLD Heather Inc."]
["08 – Ordre des orthophonistes et audiologistes du Québec",8,null,null,null,null,"1269-4659 – CHU Sainte-Justine"]
["09 – Ordre des psychoéducateurs et psychoéducatrices du Québec",9,null,null,null,null,"1273-0628 – CS Tulattavik de l'Ungava"]
["10 – Ordre des psychologues du Québec",10,null,null,null,null,"1279-7577 – INPL Philippe-Pinel"]
["11 – Ordre des technologues en imagerie médicale, en radio‐oncologie et en électrophysiologie médicale du Québec",11,null,null,null,null,"1282-5188 – Résidence Riviera Inc."]
["12 – Ordre des technologues en prothèses et appareils dentaires du Québec",12,null,null,null,null,"1297-9662 – Pavillon Ste-Marie Inc."]
["13 – Ordre des travailleurs sociaux et des thérapeutes conjugaux et familiaux du Québec",13,null,null,null,null,"1300-0732 – Les Cèdres – CA pour personnes agées"]
["14 – Ordre professionnel de la physiothérapie du Québec",14,null,null,null,null,"1302-7073 – Centre d'hébergement du Boisé Ltée"]
["15 – Ordre professionnel des criminologues du Québec",15,null,null,null,null,"1331-7037 – Pavillon Bellevue Inc."]
["16 – Ordre professionnel des diététistes du Québec",16,null,null,null,null,"1350-6472 – Hôpital Shriners pour enfants Inc."]
["17 – Ordre professionnel des sexologues du Québec",17,null,null,null,null,"1357-8448 – Accueil du Rivage Inc."]
["18 – Ordre professionnel des technologistes médicaux du Québec",18,null,null,null,null,"1362-3616 – Inst. univ. cardio. et pneumo. de Québec – UL"]
["19 – Ordre des sages-femmes du Québec",19]
["20 – Ordre des pharmaciens du Québec",20]
[]
[]
["Ordre_1"]
["1701 – Conseiller d'orientation ou conseillère d'orientation"]
[]
["Ordre_2"]
["1230 – Ergothérapeute"]
[]
["Ordre_3"]
["2261 – Hygiéniste dentaire"]
[]
["Ordre_4"]
["3445 – Infirmier auxiliaire chef d'équipe ou infirmière auxiliaire chef d'équipe"]
["3455 – Infirmier auxiliaire ou infirmière auxiliaire"]
["3529 – Infirmier auxiliaire en stage d'actualisation ou infirmière auxiliaire en stage d'actualisation"]
[]
["Ordre_5"]
["2459 – Infirmier chef d'équipe ou infirmière chef d'équipe"]
["2462 – Infirmier moniteur ou infirmière monitrice"]
["2471 – Infirmier ou infirmière"]
["2473 – Infirmier ou infirmière (Institut Pinel)"]
["2485 – Infirmier en stage d'actualisation ou infirmière en stage d'actualisation"]
["2489 – Assistant-infirmier-chef ou assistante-infirmière-chef ou assistant du supérieur immédiat ou assistante du supérieur immédiat"]
["2491 – Infirmier en dispensaire ou infirmière en dispensaire"]
["1907 – Infirmier clinicien ou infirmière clinicienne (Institut Pinel)"]
["1911 – Infirmier clinicien ou infirmière clinicienne"]
["1912 – Infirmier clinicien assistant infirmier-chef ou infirmière clinicienne assistante infirmière-chef ou infirmier clinicien assistant du supérieur immédiat ou infirmière clinicienne assistante du supérieur immédiat"]
["1913 – Conseiller ou conseillère en soins infirmiers"]
["1915 – Infirmier praticien spécialisé ou infirmière praticienne spécialisée"]
["1916 – Infirmier premier assistant en chirurgie ou infirmière première assistante en chirurgie"]
["1917 – Infirmier clinicien spécialisé ou infirmière clinicienne spécialisée"]
[]
["Ordre_6"]
["2244 – Inhalothérapeute"]
["2246 – Coordonnateur ou coordonnatrice technique (inhalothérapie)"]
["2247 – Chargé ou chargée de l'enseignement clinique (inhalothérapie)"]
["2248 – Assistant-chef inhalothérapeute ou assistante-chef inhalothérapeute"]
[]
["Ordre_7"]
["2363 – Opticien ou opticienne d'ordonnances"]
[]
["Ordre_8"]
["1204 – Audiologiste-orthophoniste"]
["1254 – Audiologiste"]
["1255 – Orthophoniste"]
[]
["Ordre_9"]
["1652 – Psychoéducateur ou psychoéducatrice"]
[]
["Ordre_10"]
["1546 – Psychologue"]
[]
["Ordre_11"]
["2205 – Technologue en imagerie médicale du domaine du radiodiagnostic"]
["2207 – Technologue en radio-oncologie"]
["2208 – Technologue en imagerie médicale du domaine de la médecine nucléaire"]
["2212 – Technologue spécialisé ou technologue spécialisée en imagerie médicale"]
["2213 – Coordonnateur ou coordonnatrice technique (radiologie)"]
["2214 – Instituteur ou institutrice clinique (radiologie)"]
["2219 – Assistant-chef technologue en radiologie ou assistante-chef technologue en radiologie"]
["2222 – Technologue en radiologie (Système d'information et d'imagerie numérique)"]
["2236 – Assistant-chef technologue en électrophysiologie médicale ou assistante-chef technologue en électrophysiologie médicale"]
["2276 – Coordonnateur ou coordonnatrice technique en électrophysiologie médicale"]
["2286 – Technologue en électrophysiologie médicale"]
[]
{"$rows_left_out":42}